{"text_format":"1","workbook":"xlsx","n_sheets":15,"sheets":["Title Sheet","References","Inputs","Effectiveness","Cost Inputs","Resource Use","Calculations","Comp Model","Tx Costs","Comp Costs","Results","Survival","Cost Chart","SA Chart","SA Chart (2)"],"not_rendered":{"charts":4,"images":2,"macros":1,"external_links":0,"defined_names":2,"comments":6,"pivot_tables":0},"unopened":[],"bounds":{"document_bytes":16777216,"sheet_cells":100000,"rows_first":2000,"rows_last":500,"rows_between":2000,"halvings":0,"cell_chars":16384,"cell_head_chars":4096},"cells_cut":0,"cells_raw":0,"read":"whole","date_system":"1900"}

{"sheet":"Title Sheet","index":0,"n_rows":27,"n_cols":3,"rows_kept":27,"cut":false,"hidden":false,"merged":[[3,2,3,3],[12,2,15,5]]}
[]
[]
[]
[null,null,"An Economic Evaluation of the Use of Copper in Reducing the Rate of Healthcare Associated Infections in the UK"]
[]
[]
[]
[]
[]
[]
[]
[]
[null,null,"The purpose of this model is to calculate the number and associated costs of Healthcare Associated Infections in different clinical settings and to evaluate the benefits of a copper intervention on key touch surfaces compared to non-copper items.  It then calculates the Return on Investment (ROI) and indicates other tangible benefits.\nThese assumptions are based on a new build or planned renovation so installation costs (which would be similar) have therefore not been considered.\nThe model should be navigated using the buttons on the left hand side of the screen to go to sections for model Inputs, Calculations and Results and at the top of the page to move to screens within these sections.  It should be noted that the main areas for users are the Inputs and Results sections of the model.\n\nCells within the model are colour coded as follows:"]
[]
[]
{"$rows_left_out":13}
{"sheet":"References","index":1,"n_rows":186,"n_cols":5,"rows_kept":186,"cut":false,"hidden":false,"merged":[[3,2,3,4],[22,2,22,4],[24,2,24,4],[26,2,26,4]]}
[]
[]
[]
[null,null,"Model Inputs"]
[]
[]
[]
[]
[]
[null,null,"Baseline infection rates","Source","Link"]
[null,null,"E. Coli","Quarterly Epidemiological Commentary: Mandatory MRSA, MSSA and E. coli bacteraemia, and C. difficile infection data (up to January–March 2012). Health protection agency. June 2012","http://www.hpa.org.uk/webc/HPAwebFile/HPAweb_C/1317135985134"]
[null,null,"Enterobacter aerogenes","Klebsiella, Enterobacter, Serratia, and Citrobacter bacteraemia, England, Wales, and Northern Ireland: 2006-2010. Health protection agency","http://www.hpa.org.uk/hpr/archives/2012/hpr4212_klbsll.pdf"]
[null,null,"MRSA","Epidemiology, clinical and laboratory characteristics of Staphylococcus aureus bacteraemia in a university hospital in UK. I. Das et al. Journal of Hospital Infection (2007) 65, 117-123"]
[null,null,"Pseudomonas aeruginosa","Pseudomonas spp. and Stenotrophomonas maltophilia bacteraemia in England, Wales, and Northern Ireland, 2007 to 2011. Health protection agency","http://www.hpa.org.uk/webc/HPAwebFile/HPAweb_C/1317135098542"]
[null,null,"Staphilococus aureus","Epidemiology, clinical and laboratory characteristics of Staphylococcus aureus bacteraemia in a university hospital in UK. I. Das et al. Journal of Hospital Infection (2007) 65, 117-123"]
{"$rows_left_out":172}
{"sheet":"Inputs","index":2,"n_rows":135,"n_cols":7,"rows_kept":135,"cut":false,"hidden":false,"merged":[[23,3,23,6],[21,3,21,6],[3,2,3,4],[15,3,15,4],[16,3,16,4],[8,2,10,13],[12,3,12,4],[14,3,14,4],[13,3,13,4]]}
[]
[]
[]
[null,null,"Model Inputs"]
[]
[]
[]
[]
[null,null,"The purpose of this sheet is to set up the model for the appropriate hospital setting.  The typical number of patients and any predictions for increases or decreases over time should be entered in the cells shaded in green.  Whether or not copper items will be introduced to general wards, ICU or single rooms can be selected in the drop down menu and the name of the pathogen in the model can be entered in the appropriate green shaded cell ."]
[]
[]
[]
[null,null,"Number of beds in unit",20]
[null,null,"Average length of stay in ICU (days)",5.7]
[null,null,"Average length of stay ward/single room (days)",3]
{"$rows_left_out":121}
{"sheet":"Effectiveness","index":3,"n_rows":185,"n_cols":33,"rows_kept":185,"cut":false,"hidden":false,"merged":[[12,6,12,8],[11,3,11,11],[12,9,12,11],[3,2,3,3],[102,3,102,4],[102,5,103,5],[12,3,12,5],[8,2,9,9],[24,6,24,8],[26,2,26,11]]}
[]
[]
[]
[null,null,"Model Inputs"]
[]
[]
[]
[]
[null,null,"The following infection rates are taken from published papers. To change to hospital specific rates, the rate and the time period in months over which the infections occurred should be entered into the appropriate cells and 'user defined data' should be selected in the drop down menu. A new monthly rate will automatically be calculated. "]
[]
[null,null,null,null,null,null,null,null,null,null,null,null,null,null,null,null,null,null,null,null,null,null,null,null,null,null,null,null,null,null,null,null,"E. Coli"]
[null,null,null,"Monthly infection rate",null,null,null,null,null,null,null,null,null,null,null,null,null,null,null,null,null,null,null,null,null,null,null,null,null,null,null,null,"Enterobacter aerogenes"]
[null,null,null,"ICU",null,null,"Ward",null,null,"Single room",null,null,null,null,null,null,null,null,null,null,null,null,null,null,null,null,null,null,null,null,null,null,"MRSA"]
[null,null,null,"Rate","Time period (months)","Monthly rate","Rate","Time period (months)","Monthly rate","Rate","Time period (months)","Monthly rate",null,null,null,null,null,null,null,null,null,null,null,null,null,null,null,null,null,null,null,null,"Pseudomonas aeruginosa"]
[null,null,"E. Coli",{"$f":"61/100000","v":6.0999999999999997E-4},10,{"$f":"D15/E15","v":6.0999999999999999E-5},null,null,{"$f":"IFERROR(0,G15/H15)","v":0},null,null,{"$f":"IFERROR(0,J15/K15)","v":0},null,null,null,null,null,null,null,null,null,null,null,null,null,null,null,null,null,null,null,null,"Staphilococus Aureus"]
{"$rows_left_out":171}
{"sheet":"Cost Inputs","index":4,"n_rows":138,"n_cols":21,"rows_kept":138,"cut":false,"hidden":false,"merged":[[27,2,27,7],[3,2,3,3],[19,3,19,4],[19,6,19,7],[14,5,14,7],[14,2,14,3],[15,2,15,3],[16,2,16,3],[9,2,11,13]]}
[]
[]
[]
[null,null,"Model Inputs"]
[]
[]
[]
[]
[]
[null,null,"This sheet is used to calculate the cost of an infection and the copper intervention.  Costs included are the unit cost for one additional day the patient will stay in hospital due to acquiring an infection and further GP and outpatient costs after leaving hospital.  (The number of excess hospital days, GP visits and outpatient visits that a patient may need are entered in the Resource Use sheet.)   The default costs for equipment are for those used in the Salgado study.  Optional copper items can also be added but it should be noted that this only adds to the cost of the copper intervention as the model is unable to take into account any additional benefit given the clinical evidence currently available."]
[]
[]
[]
[null,null,null,null,"Unit cost",null,null,null,null,null,null,null,null,null,null,null,null,null,null,null,"Total per event"]
[null,null,"Cost of an additional day in hospital due to infection",null,1000,null,null,null,null,null,null,null,null,null,null,null,null,null,null,"E. Coli",{"$f":"$E$15*'Resource Use'!D15+$E$16*'Resource Use'!E15+$E$17*'Resource Use'!F15","v":5000}]
{"$rows_left_out":124}
{"sheet":"Resource Use","index":5,"n_rows":34,"n_cols":6,"rows_kept":34,"cut":false,"hidden":false,"merged":[[3,2,3,3],[8,2,9,9],[23,2,23,4]]}
[]
[]
[]
[null,null,"Model Inputs"]
[]
[]
[]
[]
[null,null,"This sheet is used to enter the resources a patient will use as a result of acquiring an infection.  These are extra days in hospital and subsequent visits to a GP and/or an outpatient visit.  These resources are assumptions and should be changed to reflect local care pathways"]
[]
[]
[null,null,"Resource use for an event"]
[]
[null,null,null,"Extra days in hospital","General practitioner visit","Follow up outpatient visit"]
[null,null,"E. Coli",5,1,1]
{"$rows_left_out":20}
{"sheet":"Calculations","index":6,"n_rows":192,"n_cols":16,"rows_kept":192,"cut":false,"hidden":false,"merged":[[3,2,3,3],[10,15,12,20]]}
[]
[]
[]
[null,null,"Calculations"]
[]
[]
[]
[]
[]
[]
[null,null,"Month","Cohort","E. Coli","Enterobacter aerogenes","Methicillin-resistant Staphylococcus aureus (MRSA)","Pseudomonas aeruginosa","Staphilococus aureus","Vancomycin-resistant enterococcus faecalis (VRE)",{"$f":"Inputs!D22","v":"All Healthcare Associated Infections"},"All infections",null,"Cumulative infections",null,"The calculations pages show the number of infections each month and a cumulative figure. These pages are purely for transparency of the model and are for information only."]
[null,null,0,{"$f":"Inputs!$D$16","v":1200},0,0,0,0,0,0,0,{"$f":"SUM(E12:K12)","v":0},null,{"$f":"L12","v":0}]
[null,null,1,{"$f":"Inputs!$D$16","v":1200},{"$f":"IF(Inputs!$F$71=1,0,D13*Effectiveness!$E$105+E12*(1-Effectiveness!$D$61))","v":0},{"$f":"IF(Inputs!$F$71=1,0,D13*Effectiveness!$E$106+F12*(1-Effectiveness!$D$62))","v":0},{"$f":"IF(Inputs!$F$71=1,0,D13*Effectiveness!$E$107+G12*(1-Effectiveness!$D$63))","v":0},{"$f":"IF(Inputs!$F$71=1,0,D13*Effectiveness!$E$108+H12*(1-Effectiveness!$D$64))","v":0},{"$f":"IF(Inputs!$F$71=1,0,D13*Effectiveness!$E$109+I12*(1-Effectiveness!$D$65))","v":0},{"$f":"IF(Inputs!$F$71=1,0,D13*Effectiveness!$E$110+J12*(1-Effectiveness!$D$66))","v":0},{"$f":"D13*Effectiveness!$E$111+K12*(1-Effectiveness!$D$67)","v":21.680000000000003},{"$f":"SUM(E13:K13)","v":21.680000000000003},null,{"$f":"L13+N12","v":21.680000000000003}]
[null,null,2,{"$f":"Inputs!$D$16","v":1200},{"$f":"IF(Inputs!$F$71=1,0,D14*Effectiveness!$E$105+E13*(1-Effectiveness!$D$61))","v":0},{"$f":"IF(Inputs!$F$71=1,0,D14*Effectiveness!$E$106+F13*(1-Effectiveness!$D$62))","v":0},{"$f":"IF(Inputs!$F$71=1,0,D14*Effectiveness!$E$107+G13*(1-Effectiveness!$D$63))","v":0},{"$f":"IF(Inputs!$F$71=1,0,D14*Effectiveness!$E$108+H13*(1-Effectiveness!$D$64))","v":0},{"$f":"IF(Inputs!$F$71=1,0,D14*Effectiveness!$E$109+I13*(1-Effectiveness!$D$65))","v":0},{"$f":"IF(Inputs!$F$71=1,0,D14*Effectiveness!$E$110+J13*(1-Effectiveness!$D$66))","v":0},{"$f":"D14*Effectiveness!$E$111+K13*(1-Effectiveness!$D$67)","v":21.680000000000003},21.680000000000003,null,{"$f":"L14+N13","v":43.360000000000007}]
[null,null,3,{"$f":"Inputs!$D$16","v":1200},{"$f":"IF(Inputs!$F$71=1,0,D15*Effectiveness!$E$105+E14*(1-Effectiveness!$D$61))","v":0},{"$f":"IF(Inputs!$F$71=1,0,D15*Effectiveness!$E$106+F14*(1-Effectiveness!$D$62))","v":0},{"$f":"IF(Inputs!$F$71=1,0,D15*Effectiveness!$E$107+G14*(1-Effectiveness!$D$63))","v":0},{"$f":"IF(Inputs!$F$71=1,0,D15*Effectiveness!$E$108+H14*(1-Effectiveness!$D$64))","v":0},{"$f":"IF(Inputs!$F$71=1,0,D15*Effectiveness!$E$109+I14*(1-Effectiveness!$D$65))","v":0},{"$f":"IF(Inputs!$F$71=1,0,D15*Effectiveness!$E$110+J14*(1-Effectiveness!$D$66))","v":0},{"$f":"D15*Effectiveness!$E$111+K14*(1-Effectiveness!$D$67)","v":21.680000000000003},{"$f":"SUM(E15:K15)","v":21.680000000000003},null,{"$f":"L15+N14","v":65.040000000000006}]
{"$rows_left_out":178}
{"sheet":"Comp Model","index":7,"n_rows":192,"n_cols":16,"rows_kept":192,"cut":false,"hidden":false,"merged":[[3,2,3,3],[10,15,12,20]]}
[]
[]
[]
[null,null,"Calculations"]
[]
[]
[]
[]
[]
[]
[null,null,"Month","Cohort","E. Coli","Enterobacter aerogenes","Methicillin-resistant Staphylococcus aureus (MRSA)","Pseudomonas aeruginosa","Staphilococus aureus","Vancomycin-resistant enterococcus faecalis (VRE)",{"$f":"Inputs!D22","v":"All Healthcare Associated Infections"},"All infections",null,"Cumulative infections",null,"The calculations pages show the number of infections each month and a cumulative figure. These pages are purely for transparency of the model and are for information only."]
[null,null,0,{"$f":"Inputs!$D$16","v":1200},0,0,0,0,0,0,0,{"$f":"SUM(E12:K12)","v":0},null,{"$f":"L12","v":0}]
[null,null,1,{"$f":"Inputs!$D$16","v":1200},{"$f":"IF(Inputs!$F$71=1,0,$D$12*Effectiveness!$D$105+E12*(1-Effectiveness!$D$61))","v":0},{"$f":"IF(Inputs!$F$71=1,0,$D$12*Effectiveness!$D$106+F12*(1-Effectiveness!$D$62))","v":0},{"$f":"IF(Inputs!$F$71=1,0,$D$12*Effectiveness!$D$107+G12*(1-Effectiveness!$D$63))","v":0},{"$f":"IF(Inputs!$F$71=1,0,$D$12*Effectiveness!$D$108+H12*(1-Effectiveness!$D$64))","v":0},{"$f":"IF(Inputs!$F$71=1,0,$D$12*Effectiveness!$D$109+I12*(1-Effectiveness!$D$65))","v":0},{"$f":"IF(Inputs!$F$71=1,0,$D$12*Effectiveness!$D$110+J12*(1-Effectiveness!$D$66))","v":0},{"$f":"D13*Effectiveness!$D$111+K12*(1-Effectiveness!$D$67)","v":27.1},{"$f":"SUM(E13:K13)","v":27.1},null,{"$f":"L13+N12","v":27.1}]
[null,null,2,{"$f":"Inputs!$D$16","v":1200},{"$f":"IF(Inputs!$F$71=1,0,$D$12*Effectiveness!$D$105+E13*(1-Effectiveness!$D$61))","v":0},{"$f":"IF(Inputs!$F$71=1,0,$D$12*Effectiveness!$D$106+F13*(1-Effectiveness!$D$62))","v":0},{"$f":"IF(Inputs!$F$71=1,0,$D$12*Effectiveness!$D$107+G13*(1-Effectiveness!$D$63))","v":0},{"$f":"IF(Inputs!$F$71=1,0,$D$12*Effectiveness!$D$108+H13*(1-Effectiveness!$D$64))","v":0},{"$f":"IF(Inputs!$F$71=1,0,$D$12*Effectiveness!$D$109+I13*(1-Effectiveness!$D$65))","v":0},{"$f":"IF(Inputs!$F$71=1,0,$D$12*Effectiveness!$D$110+J13*(1-Effectiveness!$D$66))","v":0},{"$f":"D14*Effectiveness!$D$111+K13*(1-Effectiveness!$D$67)","v":27.1},27.1,null,{"$f":"L14+N13","v":54.2}]
[null,null,3,{"$f":"Inputs!$D$16","v":1200},{"$f":"IF(Inputs!$F$71=1,0,$D$12*Effectiveness!$D$105+E14*(1-Effectiveness!$D$61))","v":0},{"$f":"IF(Inputs!$F$71=1,0,$D$12*Effectiveness!$D$106+F14*(1-Effectiveness!$D$62))","v":0},{"$f":"IF(Inputs!$F$71=1,0,$D$12*Effectiveness!$D$107+G14*(1-Effectiveness!$D$63))","v":0},{"$f":"IF(Inputs!$F$71=1,0,$D$12*Effectiveness!$D$108+H14*(1-Effectiveness!$D$64))","v":0},{"$f":"IF(Inputs!$F$71=1,0,$D$12*Effectiveness!$D$109+I14*(1-Effectiveness!$D$65))","v":0},{"$f":"IF(Inputs!$F$71=1,0,$D$12*Effectiveness!$D$110+J14*(1-Effectiveness!$D$66))","v":0},{"$f":"D15*Effectiveness!$D$111+K14*(1-Effectiveness!$D$67)","v":27.1},27.1,null,81.300000000000011]
{"$rows_left_out":178}
{"sheet":"Tx Costs","index":8,"n_rows":218,"n_cols":35,"rows_kept":218,"cut":false,"hidden":false,"merged":[[3,2,3,3],[10,21,15,23]]}
[]
[]
[]
[null,null,"Calculations"]
[]
[]
[]
[]
[]
[]
[null,null,"Month","Bed rails","Overbed tray table","Chair","Call button","Data device","IV pole","Other items","E. Coli","Enterobacter aerogenes","Methicillin-resistant Staphylococcus aureus (MRSA)","Pseudomonas aeruginosa","Staphilococus aureus","Vancomycin-resistant enterococcus faecalis (VRE)",null,{"$f":"Inputs!D22","v":"All Healthcare Associated Infections"},"Total (month)","Total (cumulative)",null,"The calculations pages show the number of infections each month and a cumulative figure. These pages are purely for transparency of the model and are for information only.",null,null,null,null,null,null,null,null,null,null,null,null,"month"]
[null,null,0,{"$f":"'Cost Inputs'!$G$22","v":80000},{"$f":"'Cost Inputs'!$G$23","v":6000},{"$f":"'Cost Inputs'!G24","v":7000},{"$f":"'Cost Inputs'!G25","v":1000},{"$f":"'Cost Inputs'!G26","v":5000},{"$f":"'Cost Inputs'!G27","v":6000},{"$f":"SUM('Cost Inputs'!G29:G39)","v":0},{"$f":"Calculations!E12*'Cost Inputs'!$U$15","v":0},{"$f":"Calculations!F12*'Cost Inputs'!$U$16","v":0},{"$f":"Calculations!G12*'Cost Inputs'!$U$17","v":0},{"$f":"Calculations!H12*'Cost Inputs'!$U$18","v":0},{"$f":"Calculations!I12*'Cost Inputs'!$U$19","v":0},{"$f":"Calculations!J12*'Cost Inputs'!$U$20","v":0},null,{"$f":"Calculations!K12*'Cost Inputs'!$U$21","v":0},{"$f":"SUM(D12:R12)","v":105000},{"$f":"S12","v":105000},null,null,null,null,null,null,null,null,null,null,null,null,null,{"$f":"IF(T12>'Comp Costs'!T12,1,0)","v":1},{"$f":"C12","v":0}]
[null,null,1,0,0,0,0,0,0,0,{"$f":"Calculations!E13*'Cost Inputs'!$U$15","v":0},{"$f":"Calculations!F13*'Cost Inputs'!$U$16","v":0},{"$f":"Calculations!G13*'Cost Inputs'!$U$17","v":0},{"$f":"Calculations!H13*'Cost Inputs'!$U$18","v":0},{"$f":"Calculations!I13*'Cost Inputs'!$U$19","v":0},{"$f":"Calculations!J13*'Cost Inputs'!$U$20","v":0},null,{"$f":"Calculations!K13*'Cost Inputs'!$U$21","v":130080.00000000001},{"$f":"SUM(D13:R13)","v":130080.00000000001},{"$f":"S13+T12","v":235080},null,null,null,null,null,null,null,null,null,null,null,null,null,{"$f":"IF(T13>'Comp Costs'!T13,1,0)","v":0},1]
[null,null,2,0,0,0,0,0,0,0,{"$f":"Calculations!E14*'Cost Inputs'!$U$15","v":0},{"$f":"Calculations!F14*'Cost Inputs'!$U$16","v":0},{"$f":"Calculations!G14*'Cost Inputs'!$U$17","v":0},{"$f":"Calculations!H14*'Cost Inputs'!$U$18","v":0},{"$f":"Calculations!I14*'Cost Inputs'!$U$19","v":0},{"$f":"Calculations!J14*'Cost Inputs'!$U$20","v":0},null,{"$f":"Calculations!K14*'Cost Inputs'!$U$21","v":130080.00000000001},130080.00000000001,{"$f":"S14+T13","v":365160},null,null,null,null,null,null,null,null,null,null,null,null,null,{"$f":"IF(T14>'Comp Costs'!T14,1,0)","v":0},2]
[null,null,3,0,0,0,0,0,0,0,{"$f":"Calculations!E15*'Cost Inputs'!$U$15","v":0},{"$f":"Calculations!F15*'Cost Inputs'!$U$16","v":0},{"$f":"Calculations!G15*'Cost Inputs'!$U$17","v":0},{"$f":"Calculations!H15*'Cost Inputs'!$U$18","v":0},{"$f":"Calculations!I15*'Cost Inputs'!$U$19","v":0},{"$f":"Calculations!J15*'Cost Inputs'!$U$20","v":0},null,{"$f":"Calculations!K15*'Cost Inputs'!$U$21","v":130080.00000000001},130080.00000000001,495240,null,null,null,null,null,null,null,null,null,null,null,null,null,{"$f":"IF(T15>'Comp Costs'!T15,1,0)","v":0},3]
{"$rows_left_out":204}
{"sheet":"Comp Costs","index":9,"n_rows":192,"n_cols":22,"rows_kept":192,"cut":false,"hidden":false,"merged":[[3,2,3,3],[10,21,14,23]]}
[]
[]
[]
[null,null,"Calculations"]
[]
[]
[]
[]
[]
[]
[null,null,"Month","Bed rails","Overbed tray table","Chair","Call button","Data device","IV pole","Other items","E. Coli","Enterobacter aerogenes","Methicillin-resistant Staphylococcus aureus (MRSA)","Pseudomonas aeruginosa","Staphilococus aureus","Vancomycin-resistant enterococcus faecalis (VRE)",null,{"$f":"Inputs!D22","v":"All Healthcare Associated Infections"},"Total (month)","Total (cumulative)",null,"The calculations pages show the number of infections each month and a cumulative figure. These pages are purely for transparency of the model and are for information only."]
[null,null,0,{"$f":"'Cost Inputs'!$H22","v":60000},{"$f":"'Cost Inputs'!$H23","v":3000},{"$f":"'Cost Inputs'!H24","v":5000},{"$f":"'Cost Inputs'!H25","v":400},{"$f":"'Cost Inputs'!H26","v":2000},{"$f":"'Cost Inputs'!H27","v":4000},{"$f":"SUM('Cost Inputs'!H29:H39)","v":0},{"$f":"'Comp Model'!E12*'Cost Inputs'!$U$15","v":0},{"$f":"'Comp Model'!F12*'Cost Inputs'!$U$16","v":0},{"$f":"'Comp Model'!G12*'Cost Inputs'!$U$17","v":0},{"$f":"'Comp Model'!H12*'Cost Inputs'!$U$18","v":0},{"$f":"'Comp Model'!I12*'Cost Inputs'!$U$19","v":0},{"$f":"'Comp Model'!J12*'Cost Inputs'!$U$20","v":0},null,{"$f":"'Comp Model'!K12*'Cost Inputs'!$U$21","v":0},{"$f":"SUM(D12:R12)","v":74400},{"$f":"S12","v":74400}]
[null,null,1,0,0,0,0,0,0,0,{"$f":"'Comp Model'!E13*'Cost Inputs'!$U$15","v":0},{"$f":"'Comp Model'!F13*'Cost Inputs'!$U$16","v":0},{"$f":"'Comp Model'!G13*'Cost Inputs'!$U$17","v":0},{"$f":"'Comp Model'!H13*'Cost Inputs'!$U$18","v":0},{"$f":"'Comp Model'!I13*'Cost Inputs'!$U$19","v":0},{"$f":"'Comp Model'!J13*'Cost Inputs'!$U$20","v":0},null,{"$f":"'Comp Model'!K13*'Cost Inputs'!$U$21","v":162600},{"$f":"SUM(D13:R13)","v":162600},{"$f":"S13+T12","v":237000}]
[null,null,2,0,0,0,0,0,0,0,{"$f":"'Comp Model'!E14*'Cost Inputs'!$U$15","v":0},{"$f":"'Comp Model'!F14*'Cost Inputs'!$U$16","v":0},{"$f":"'Comp Model'!G14*'Cost Inputs'!$U$17","v":0},{"$f":"'Comp Model'!H14*'Cost Inputs'!$U$18","v":0},{"$f":"'Comp Model'!I14*'Cost Inputs'!$U$19","v":0},{"$f":"'Comp Model'!J14*'Cost Inputs'!$U$20","v":0},null,{"$f":"'Comp Model'!K14*'Cost Inputs'!$U$21","v":162600},162600,{"$f":"S14+T13","v":399600}]
[null,null,3,0,0,0,0,0,0,0,{"$f":"'Comp Model'!E15*'Cost Inputs'!$U$15","v":0},{"$f":"'Comp Model'!F15*'Cost Inputs'!$U$16","v":0},{"$f":"'Comp Model'!G15*'Cost Inputs'!$U$17","v":0},{"$f":"'Comp Model'!H15*'Cost Inputs'!$U$18","v":0},{"$f":"'Comp Model'!I15*'Cost Inputs'!$U$19","v":0},{"$f":"'Comp Model'!J15*'Cost Inputs'!$U$20","v":0},null,{"$f":"'Comp Model'!K15*'Cost Inputs'!$U$21","v":162600},162600,562200]
{"$rows_left_out":178}
{"sheet":"Results","index":10,"n_rows":170,"n_cols":6,"rows_kept":170,"cut":false,"hidden":false,"merged":[[26,2,27,5],[3,2,3,5],[5,2,5,5]]}
[]
[]
[]
[]
[null,null,"An Economic Evaluation of the Use of Copper in Reducing the Rate of Healthcare Associated Infections in the UK."]
[null,null,"The purpose of this model is to calculate the number and associated costs of Healthcare Associated Infections in different clinical settings and to evaluate the benefits of a copper intervention on key touch surfaces compared to non-copper items.  It then calculates the Return on Investment (ROI) and indicates other tangible benefits."]
[]
[null,null,"5 year results"]
[null,null,null,"Copper","Baseline","Incremental"]
[null,null,"Total cost (excluding cost of infections)*",{"$f":"SUM('Tx Costs'!D12:I72)","v":105000},{"$f":"SUM('Comp Costs'!D12:I72)","v":74400},{"$f":"D10-E10","v":30600}]
[null,null,"Number of infections",{"$f":"Calculations!N72","v":1300.7999999999997},{"$f":"'Comp Model'!N72","v":1625.9999999999986},{"$f":"E11-D11","v":325.19999999999891}]
[null,null,"Cost per infection averted (excluding cost of infections)",null,null,{"$f":"IF(F11<0,\"Less effective\",IF(F11=0,IF(F10<0,\"Cost saving\",IF(F10=0,\"No difference\",\"Cost increasing\")),IF(F10<=0,\"Dominant\",F10/F11)))","v":94.095940959409916}]
[null,null,"Total QALYS gained",null,null,{"$f":"F11*(1-0.642)","v":116.4215999999996}]
[null,null,"Cost per QALY",null,null,{"$f":"F10/F13","v":262.83782390896624}]
[null,null,"Cost of infections*",{"$f":"SUM('Tx Costs'!K12:R72)","v":7804800.0000000009},{"$f":"SUM('Comp Costs'!K12:R72)","v":9756000},{"$f":"D15-E15","v":-1951199.9999999991}]
{"$rows_left_out":156}
{"sheet":"Survival","index":11,"n_rows":28,"n_cols":4,"rows_kept":28,"cut":false,"hidden":false,"merged":[[3,2,3,3],[21,2,21,4],[27,3,28,7]]}
[]
[]
[]
[null,null,"Results"]
[]
[]
[]
[]
[]
[]
[]
[]
[]
[]
[]
{"$rows_left_out":14}
{"sheet":"Cost Chart","index":12,"n_rows":31,"n_cols":4,"rows_kept":31,"cut":false,"hidden":false,"merged":[[3,2,3,3],[21,2,21,4],[27,3,28,7]]}
[]
[]
[]
[null,null,"Results"]
[]
[]
[]
[]
[]
[]
[]
[]
[]
[]
[]
{"$rows_left_out":17}
{"sheet":"SA Chart","index":13,"n_rows":42,"n_cols":5,"rows_kept":42,"cut":false,"hidden":false,"merged":[[27,3,29,7],[3,1,3,3]]}
[]
[]
[]
[null,"   Results"]
[]
[]
[]
[]
[]
[]
[]
[]
[]
[]
[]
{"$rows_left_out":28}
{"sheet":"SA Chart (2)","index":14,"n_rows":28,"n_cols":4,"rows_kept":28,"cut":false,"hidden":false,"merged":[[3,2,3,3],[27,3,29,7]]}
[]
[]
[]
[null,null,"Results"]
[]
[]
[]
[]
[]
[]
[]
[]
[]
[]
[]
{"$rows_left_out":13}